Welcome, Guest
Username: Password: Remember me
Discussions for CodeTyphon Studio Installation and Setup.
  • Page:
  • 1

TOPIC:

Cannot install CodeTyphon 1 year 1 week ago #17749

  • Tod Arivah
  • Tod Arivah's Avatar Topic Author
  • Offline
  • Junior Member
  • Junior Member
  • Posts: 44
  • Thank you received: 0
Brand new computer, Windows 10 Pro, running install.bat as administrator

Results:

C:/codetyphon/fpc/fpc64/bin/x86_64-win64/make.exe -C packager/registration
make[1]: Entering directory 'C:/codetyphon/typhon/packager/registration'
C:/codetyphon/fpc/fpc64/bin/x86_64-win64/rm.exe -f ../units/x86_64-win64/fcllaz.ppu
C:/codetyphon/fpc/fpc64/bin/x86_64-win64/gmkdir.exe -p ../units/x86_64-win64
C:/codetyphon/fpc/fpc64/bin/x86_64-win64/ppcx64.exe -MObjFPC -Scghi -O1 -gw2 -godwarfsets -gl -l -vewnhibq -Fu. -FE. -FU../units/x86_64-win64 -dx86_64 fcllaz.pas
Hint: (11030) Start of reading config file C:\codetyphon\fpc\fpc64\bin\x86_64-win64\fpc.cnf
Hint: (11031) End of reading config file C:\codetyphon\fpc\fpc64\bin\x86_64-win64\fpc.cnf
Free Pascal Compiler version 3.3.1 [2023/01/03] for x86_64
Copyright (c) 1993-2022 by Florian Klaempfl and others
(1002) Target OS: Win64 for x64
(3104) Compiling fcllaz.pas
Fatal: (10022) Can't find unit system used by fcllaz
Fatal: (1018) Compilation aborted
make[1]: *** [Makefile:3355: fcllaz.ppu] Error 1
make[1]: Leaving directory 'C:/codetyphon/typhon/packager/registration'
make: *** [Makefile:3747: registration] Error 2

=======================================================

[INFO]: create ..\typhonTemp directory.

??????????????????????????????????????????????????????
[ERROR]: Typhon64 Small-IDE IDE NOT Build
??????????????????????????????????????????????????????

=====================================================================
            Build Typhon64 BIG-IDE for Win64
=====================================================================


??????????????????????????????????????????????????????
[ERROR]: Sorry, Typhon64 from Small-IDE NOT Build
         please remove and build Typhon again...
??????????????????????????????????????????????????????

Please Log in or Create an account to join the conversation.

Cannot install CodeTyphon 1 year 1 week ago #17750

  • Matis A.
  • Matis A.'s Avatar
  • Away
  • Moderator
  • Moderator
  • Posts: 1074
  • Thank you received: 153
Please
-Open CTCenter
-Do CTCenter => CodeTyphon =>"Remove and build ALL"
-Save the log of CT Center action  more info
-Zip or 7zip this log file and post here as attach.
PilotLogic Core Programmer

Please Log in or Create an account to join the conversation.

Cannot install CodeTyphon 1 year 1 week ago #17753

  • Dean Qin
  • Dean Qin's Avatar
  • Offline
  • New Member
  • New Member
  • Posts: 5
  • Thank you received: 0
same issue here on win11 64bit, administrator, fresh install

the previous error is :
                 Copy FreePascal 64bit
File not found - *.*
0 File(s) copied

 ???????????????????????????????????????????????????
[ERROR]: FreePascal 64 NOT build
 ??????????????????????????????????????????????????

maybe same as fpc 32bit

Please Log in or Create an account to join the conversation.

Cannot install CodeTyphon 1 year 1 week ago #17754

  • Dean Qin
  • Dean Qin's Avatar
  • Offline
  • New Member
  • New Member
  • Posts: 5
  • Thank you received: 0
log attached 

File Attachment:

File Name: ct_log.zip
File Size:81 KB
Attachments:

Please Log in or Create an account to join the conversation.

Cannot install CodeTyphon 1 year 1 week ago #17755

  • Matis A.
  • Matis A.'s Avatar
  • Away
  • Moderator
  • Moderator
  • Posts: 1074
  • Thank you received: 153
Can you give us more info for your PC
-Memory, CPU, DiskSpace
-Antvirus
-etc

Your log file has 4-5 times
process_begin: CreateProcess(NULL, echo Start now 10:02:37, ...) failed.
Error



 
PilotLogic Core Programmer

Please Log in or Create an account to join the conversation.

Cannot install CodeTyphon 1 year 1 week ago #17760

  • Dean Qin
  • Dean Qin's Avatar
  • Offline
  • New Member
  • New Member
  • Posts: 5
  • Thank you received: 0
I googled this error (createprocess), many users using makefile with echo under windows have the same errors, i'll have a try to fix it

my env as shown: 

1TB SSD with almost 80G free

Antivirus is Windows Defender

 
Attachments:

Please Log in or Create an account to join the conversation.

Last edit: by Dean Qin.

Cannot install CodeTyphon 10 months 3 weeks ago #17885

  • Tod Arivah
  • Tod Arivah's Avatar Topic Author
  • Offline
  • Junior Member
  • Junior Member
  • Posts: 44
  • Thank you received: 0
Now trying to install 8.10 I am getting this error:

C:/codetyphon/fpc/fpc64/bin/x86_64-win64/ppcx64.exe -gl -Fu../../units/x86_64-win64 -Fu../../../packager/units/x86_64-win64 -Fu../../../components/BaseUtils/lib/x86_64-win64 -Fu.. -Fu. -Fu../../../../fpcsrc/rtl -FE. -FU../../units/x86_64-win64/customdrawn -dx86_64 ../adlcl.pas
Fatal: Can't find unit fefontengineobjects used by feDrawerIntfImage
Fatal: Compilation aborted  

Log attached
Attachments:

Please Log in or Create an account to join the conversation.

Cannot install CodeTyphon 10 months 3 weeks ago #17886

  • Tod Arivah
  • Tod Arivah's Avatar Topic Author
  • Offline
  • Junior Member
  • Junior Member
  • Posts: 44
  • Thank you received: 0
Ok forget that.

I had some weird nordvpn service going on.

After I deactivated it everything compiled nicely.

Thanks

Please Log in or Create an account to join the conversation.

Cannot install CodeTyphon 10 months 3 weeks ago #17887

  • Matis A.
  • Matis A.'s Avatar
  • Away
  • Moderator
  • Moderator
  • Posts: 1074
  • Thank you received: 153
Thanks
PilotLogic Core Programmer

Please Log in or Create an account to join the conversation.

  • Page:
  • 1