× Discussions for CodeTyphon Studio Installation and Setup.

Question Cannot install CT 7.10 on Win 10 (64 bit)

  • tatamata
  • Topic Author
  • Offline
  • Junior Boarder
  • Junior Boarder
More
3 months 6 days ago - 3 months 6 days ago #14686 by tatamata
I am not able to install CodeTyphon 7.10. First failed by upgrading from 7.00, then tried clean install, but I always get this error:"Can't find unit system used by fcllaz"
Compile Typhon64 Win64

C:/codetyphon/fpc/fpc64/bin/x86_64-win64/make -C packager/registration
make[1]: Entering directory 'C:/codetyphon/typhon/packager/registration'
C:/codetyphon/fpc/fpc64/bin/x86_64-win64/rm.exe -f ../units/x86_64-win64/fcllaz.ppu
C:/codetyphon/fpc/fpc64/bin/x86_64-win64/gmkdir.exe -p ../units/x86_64-win64
C:/codetyphon/fpc/fpc64/bin/x86_64-win64/ppcx64.exe -MObjFPC -Scghi -O1 -g -gl -l -vewnhibq -Fu. -FE. -FU../units/x86_64-win64 -dx86_64 fcllaz.pas
Hint: (11030) Start of reading config file C:\codetyphon\fpc\fpc64\bin\x86_64-win64\fpc.cnf
Hint: (11031) End of reading config file C:\codetyphon\fpc\fpc64\bin\x86_64-win64\fpc.cnf
Free Pascal Compiler version 3.3.1 [2020/05/08] for x86_64
Copyright (c) 1993-2020 by Florian Klaempfl and others
(1002) Target OS: Win64 for x64
(3104) Compiling fcllaz.pas
Fatal: (10022) Can't find unit system used by fcllaz
Fatal: (1018) Compilation aborted
make[1]: *** [Makefile:2892: fcllaz.ppu] Error 1
make[1]: Leaving directory 'C:/codetyphon/typhon/packager/registration'
make: *** [Makefile:3535: registration] Error 2

=======================================================

??????????????????????????????????????????????????????
[ERROR]: Typhon64 Small-IDE IDE NOT Build
??????????????????????????????????????????????????????

=====================================================================
Build Typhon64 BIG-IDE for Win64
=====================================================================


??????????????????????????????????????????????????????
[ERROR]: Sorry, Typhon64 from Small-IDE NOT Build
please remove and build Typhon again...
??????????????????????????????????????????????????????
Last edit: 3 months 6 days ago by tatamata.

Please Log in or Create an account to join the conversation.

  • Sternas Stefanos
  • Sternas Stefanos's Avatar
  • Offline
  • Moderator
  • Moderator
  • Ex Pilot, M.Sc, Ph.D
More
3 months 6 days ago - 3 months 6 days ago #14687 by Sternas Stefanos
Replied by Sternas Stefanos on topic Cannot install CT 7.10 on Win 10 (64 bit)
Thanks Sir
Please
-Remove any other FPC or LAZ installations

-Open CTCenter
-Try to "Remove and Build ALL"
-Zip and Attach here the CTCenter log file more info

.

PilotLogic Architect and Core Programmer
Last edit: 3 months 6 days ago by Sternas Stefanos.

Please Log in or Create an account to join the conversation.

  • tatamata
  • Topic Author
  • Offline
  • Junior Boarder
  • Junior Boarder
More
3 months 4 days ago #14704 by tatamata
Replied by tatamata on topic Cannot install CT 7.10 on Win 10 (64 bit)
Hi, uninstalled Lazarus, deleted both Lazarus and CodeTyphon directories, installed from scratch - the same error.
Opened CT, tried remove and build all - again, the same error.
Zipped log is attached.
Attachments:

Please Log in or Create an account to join the conversation.

  • Sternas Stefanos
  • Sternas Stefanos's Avatar
  • Offline
  • Moderator
  • Moderator
  • Ex Pilot, M.Sc, Ph.D
More
3 months 3 days ago #14709 by Sternas Stefanos
Replied by Sternas Stefanos on topic Cannot install CT 7.10 on Win 10 (64 bit)
Sir
The problem is 2702 for FPC32 build and Line 7168 for FPC64 build
make[5]: Entering directory 'C:/codetyphon/fpcsrc/compiler'
process_begin: CreateProcess(NULL, echo Start now 18:36:51, ...) failed.
make (e=2): The system cannot find the file specified.

make[5]: *** [Makefile:4485: echotime] Error 2

-Your win10 edition ?
-Did you have any Antivirus ?
-The CT install/build user has administrator privileges ?

PilotLogic Architect and Core Programmer

Please Log in or Create an account to join the conversation.

  • tatamata
  • Topic Author
  • Offline
  • Junior Boarder
  • Junior Boarder
More
3 months 3 days ago #14710 by tatamata
Replied by tatamata on topic Cannot install CT 7.10 on Win 10 (64 bit)
Win 10 Pro, version 1803, Windows Defender antivirus, yes user has admin privileges.
OS Name: Microsoft Windows 10 Pro
OS Version: 10.0.17134 N/A Build 17134
...
User with Administrator Privileges: "YES-- (ALL OK)"

Please Log in or Create an account to join the conversation.

  • Sternas Stefanos
  • Sternas Stefanos's Avatar
  • Offline
  • Moderator
  • Moderator
  • Ex Pilot, M.Sc, Ph.D
More
3 months 3 days ago #14711 by Sternas Stefanos
Replied by Sternas Stefanos on topic Cannot install CT 7.10 on Win 10 (64 bit)
I can't see any other problem in your log file,
only this
process_begin: CreateProcess(NULL, echo Start now 18:36:51, ...) failed.

Please, check if in fpc_src.7z ctinfo.txt. is Rev :2004130758

PilotLogic Architect and Core Programmer

Please Log in or Create an account to join the conversation.

  • tatamata
  • Topic Author
  • Offline
  • Junior Boarder
  • Junior Boarder
More
3 months 3 days ago #14712 by tatamata
Replied by tatamata on topic Cannot install CT 7.10 on Win 10 (64 bit)
=============================================================
CodeTyphon Studio 7.10
Copyright © PilotLogic Software House
All rights reserved
=============================================================

Havy Modification of Freepascal (FPC) Source directory
Ver :3.3.1 SVN trunk
Rev :2004131121
Date:2020-04-13 11:21
Sync:44713

Please Log in or Create an account to join the conversation.

  • Sternas Stefanos
  • Sternas Stefanos's Avatar
  • Offline
  • Moderator
  • Moderator
  • Ex Pilot, M.Sc, Ph.D
More
3 months 3 days ago #14713 by Sternas Stefanos
Replied by Sternas Stefanos on topic Cannot install CT 7.10 on Win 10 (64 bit)
Please
re-download CT 7.10
or
upgrade to LAB 7.20

PilotLogic Architect and Core Programmer

Please Log in or Create an account to join the conversation.

More
1 month 1 day ago #14874 by pama badhe
Replied by pama badhe on topic Cannot install CT 7.10 on Win 10 (64 bit)
Please
re-download CT 7.10
or

Please Log in or Create an account to join the conversation.