Forum
× Discussions for CodeTyphon Studio Installation and Setup.

Question Install error

  • William
  • Topic Author
  • Offline
  • Junior Boarder
  • Junior Boarder
More
2 weeks 2 days ago - 2 weeks 2 days ago #14041 by William
Install error was created by William
I keep getting this install error on W7 machine:

Compile Typhon64 Win64

C:/codetyphon/fpc/fpc64/bin/x86_64-win64/make -C packager/registration
make[1]: Entering directory 'C:/codetyphon/typhon/packager/registration'
C:/codetyphon/fpc/fpc64/bin/x86_64-win64/rm.exe -f ../units/x86_64-win64/fcllaz.ppu
C:/codetyphon/fpc/fpc64/bin/x86_64-win64/gmkdir.exe -p ../units/x86_64-win64
C:/codetyphon/fpc/fpc64/bin/x86_64-win64/ppcx64.exe -MObjFPC -Scghi -O1 -g -gl -l -vewnhibq -Fu. -FE. -FU../units/x86_64-win64 -dx86_64 fcllaz.pas
Hint: (11030) Start of reading config file C:\codetyphon\fpc\fpc64\bin\x86_64-win64\fpc.cnf
Hint: (11031) End of reading config file C:\codetyphon\fpc\fpc64\bin\x86_64-win64\fpc.cnf
Free Pascal Compiler version 3.3.1 [2019/09/04] for x86_64
Copyright (c) 1993-2019 by Florian Klaempfl and others
(1002) Target OS: Win64 for x64
(3104) Compiling fcllaz.pas
Fatal: (10022) Can't find unit system used by fcllaz
Fatal: (1018) Compilation aborted
make[1]: *** [Makefile:2892: fcllaz.ppu] Error 1
make[1]: Leaving directory 'C:/codetyphon/typhon/packager/registration'
make: *** [Makefile:3362: registration] Error 2
Last edit: 2 weeks 2 days ago by William.

Please Log in or Create an account to join the conversation.

  • Sternas Stefanos
  • Sternas Stefanos's Avatar
  • Away
  • Moderator
  • Moderator
  • Ex Pilot, M.Sc, Ph.D
More
2 weeks 2 days ago #14042 by Sternas Stefanos
Replied by Sternas Stefanos on topic Install error
Remove any
freepascal and lazarus installations
and give us more info:
Did you run install CT as Admin ?
Did you follow the installation procedure ? more info here

PilotLogic Architect and Core Programmer

Please Log in or Create an account to join the conversation.

  • William
  • Topic Author
  • Offline
  • Junior Boarder
  • Junior Boarder
More
2 weeks 2 days ago #14047 by William
Replied by William on topic Install error
I do have lazarus installed, so I'll remove it.

I tried to run CT as Admin, but it kept saying that I was not the Admin. So I took
out the code in the install.bat and setup.bat that checked that and it ran to where you see the error.

I'll followed the instructions at the link and will try again.

"I'll be back!"

Please Log in or Create an account to join the conversation.

  • Sternas Stefanos
  • Sternas Stefanos's Avatar
  • Away
  • Moderator
  • Moderator
  • Ex Pilot, M.Sc, Ph.D
More
2 weeks 2 days ago #14048 by Sternas Stefanos
Replied by Sternas Stefanos on topic Install error
Only Admin Group user can install CodeTyphon

PilotLogic Architect and Core Programmer

Please Log in or Create an account to join the conversation.

  • William
  • Topic Author
  • Offline
  • Junior Boarder
  • Junior Boarder
More
2 weeks 1 day ago #14049 by William
Replied by William on topic Install error
Well, I don't know what is wrong. I am the only one who logs into this machine, the only one in the Admin group, and the machine shows that I am the Admin.

Please Log in or Create an account to join the conversation.

  • William
  • Topic Author
  • Offline
  • Junior Boarder
  • Junior Boarder
More
2 weeks 1 day ago - 2 weeks 1 day ago #14050 by William
Replied by William on topic Install error
OK. Got around the 'NOT Admin' error. There was a windows service that had been disabled on my system that was needed for the 'Run as Administration' right click to work correctly. So I right clicked on the install.bat and it went to the install screen. Selected 0 and hit enter. After all the install diagnostics, I still end up with this:


...

make[1]: Leaving directory 'C:/codetyphon/fpcsrc/installer'
C:/codetyphon/fpc/fpc64/bin/x86_64-win64/rm.exe -f build-stamp.*
C:/codetyphon/fpc/fpc64/bin/x86_64-win64/rm.exe -f base.build-stamp.*

[INFO]: Clean finish...

Copy FreePascal 64bit
File not found - *.*
0 File(s) copied

???????????????????????????????????????????????????
[ERROR]: FreePascal 64 NOT build
??????????????????????????????????????????????????


Prepare Typhon64 Win64

[INFO]: create ..\typhon\bin64 directory

Restore Typhon Default IDE Setings
..\binSettings\settings\i386-win32-win32\styphon\codetemplates.dci
..\binSettings\settings\i386-win32-win32\styphon\datadict.xml
..\binSettings\settings\i386-win32-win32\styphon\editoroptions.xml
..\binSettings\settings\i386-win32-win32\styphon\environmentoptions.xml
..\binSettings\settings\i386-win32-win32\styphon\fpcdefines.xml
..\binSettings\settings\i386-win32-win32\styphon\h2pastool.xml
..\binSettings\settings\i386-win32-win32\styphon\inputhistory.xml
..\binSettings\settings\i386-win32-win32\styphon\miscellaneousoptions.xml
..\binSettings\settings\i386-win32-win32\styphon\pl_ExtentIDEcfg.xml
..\binSettings\settings\i386-win32-win32\styphon\staticpackages.inc
10 File(s) copied
..\binSettings\settings\alluserschemes\zct_black.xml
..\binSettings\settings\alluserschemes\zct_blackred.xml
..\binSettings\settings\alluserschemes\zct_blue.xml
..\binSettings\settings\alluserschemes\zct_bluelite.xml
..\binSettings\settings\alluserschemes\zct_buenanoche.xml
..\binSettings\settings\alluserschemes\zct_darkwolf.xml
..\binSettings\settings\alluserschemes\zct_desert.xml
..\binSettings\settings\alluserschemes\zct_liteblue.xml
..\binSettings\settings\alluserschemes\zct_nortonic.xml
..\binSettings\settings\alluserschemes\zct_pascalclassical.xml
..\binSettings\settings\alluserschemes\zct_solarized.xml
..\binSettings\settings\alluserschemes\zct_solarizednight.xml
12 File(s) copied

[INFO]: Restore Typhon32 Settings finish

..\binSettings\settings\x86_64-win64-win32\styphon\codetemplates.dci
..\binSettings\settings\x86_64-win64-win32\styphon\datadict.xml
..\binSettings\settings\x86_64-win64-win32\styphon\editoroptions.xml
..\binSettings\settings\x86_64-win64-win32\styphon\environmentoptions.xml
..\binSettings\settings\x86_64-win64-win32\styphon\fpcdefines.xml
..\binSettings\settings\x86_64-win64-win32\styphon\h2pastool.xml
..\binSettings\settings\x86_64-win64-win32\styphon\inputhistory.xml
..\binSettings\settings\x86_64-win64-win32\styphon\miscellaneousoptions.xml
..\binSettings\settings\x86_64-win64-win32\styphon\pl_ExtentIDEcfg.xml
..\binSettings\settings\x86_64-win64-win32\styphon\staticpackages.inc
10 File(s) copied
..\binSettings\settings\alluserschemes\zct_black.xml
..\binSettings\settings\alluserschemes\zct_blackred.xml
..\binSettings\settings\alluserschemes\zct_blue.xml
..\binSettings\settings\alluserschemes\zct_bluelite.xml
..\binSettings\settings\alluserschemes\zct_buenanoche.xml
..\binSettings\settings\alluserschemes\zct_darkwolf.xml
..\binSettings\settings\alluserschemes\zct_desert.xml
..\binSettings\settings\alluserschemes\zct_liteblue.xml
..\binSettings\settings\alluserschemes\zct_nortonic.xml
..\binSettings\settings\alluserschemes\zct_pascalclassical.xml
..\binSettings\settings\alluserschemes\zct_solarized.xml
..\binSettings\settings\alluserschemes\zct_solarizednight.xml
12 File(s) copied

[INFO]: Restore Typhon64 Settings finish


Compile Typhon64 Win64

C:/codetyphon/fpc/fpc64/bin/x86_64-win64/make -C packager/registration
make[1]: Entering directory 'C:/codetyphon/typhon/packager/registration'
C:/codetyphon/fpc/fpc64/bin/x86_64-win64/rm.exe -f ../units/x86_64-win64/fcllaz.
ppu
C:/codetyphon/fpc/fpc64/bin/x86_64-win64/gmkdir.exe -p ../units/x86_64-win64
C:/codetyphon/fpc/fpc64/bin/x86_64-win64/ppcx64.exe -MObjFPC -Scghi -O1 -g -gl -
l -vewnhibq -Fu. -FE. -FU../units/x86_64-win64 -dx86_64 fcllaz.pas
Hint: (11030) Start of reading config file C:\codetyphon\fpc\fpc64\bin\x86_64-wi
n64\fpc.cnf
Hint: (11031) End of reading config file C:\codetyphon\fpc\fpc64\bin\x86_64-win6
4\fpc.cnf
Free Pascal Compiler version 3.3.1 [2019/09/04] for x86_64
Copyright (c) 1993-2019 by Florian Klaempfl and others
(1002) Target OS: Win64 for x64
(3104) Compiling fcllaz.pas
Fatal: (10022) Can't find unit system used by fcllaz
Fatal: (1018) Compilation aborted
make[1]: *** [Makefile:2892: fcllaz.ppu] Error 1
make[1]: Leaving directory 'C:/codetyphon/typhon/packager/registration'
make: *** [Makefile:3362: registration] Error 2

=======================================================

??????????????????????????????????????????????????????
[ERROR]: Typhon64 Small-IDE IDE NOT Build
??????????????????????????????????????????????????????

=====================================================================
Build Typhon64 BIG-IDE for Win64
=====================================================================


??????????????????????????????????????????????????????
[ERROR]: Sorry, Typhon64 from Small-IDE NOT Build
please remove and build Typhon again...
??????????????????????????????????????????????????????

===============================================================
CodeTyphon Studio 6.90 Setup for Windows64
Settings: Platform=Win32/64 Multiarch Mode=1
===============================================================

0) Install System Libraries
1) Run CodeTyphon Center (CTC)

11) -- Platform (widget) Setup
12) -- Multi-Architecture Setup

3) Remove FreePascal
4) Remove and Build FreePascal

5) Remove Typhon IDE
6) Remove and Build Typhon IDE

7) Remove ALL
8) Remove and Build ALL

9) EXIT

>>> Select an action (press 1..9 key):
Last edit: 2 weeks 1 day ago by William.

Please Log in or Create an account to join the conversation.

  • Sternas Stefanos
  • Sternas Stefanos's Avatar
  • Away
  • Moderator
  • Moderator
  • Ex Pilot, M.Sc, Ph.D
More
2 weeks 1 day ago - 2 weeks 1 day ago #14053 by Sternas Stefanos
Replied by Sternas Stefanos on topic Install error
My suggestion is to look/find the problem(s) in your PC

PilotLogic Architect and Core Programmer
Last edit: 2 weeks 1 day ago by Sternas Stefanos.

Please Log in or Create an account to join the conversation.

  • William
  • Topic Author
  • Offline
  • Junior Boarder
  • Junior Boarder
More
2 weeks 1 day ago #14054 by William
Replied by William on topic Install error

Sternas Stefanos wrote: My suggestion is to look/find the problem(s) in your PC


Yes, your right. I installed 6.90 on another similar Dell I have last night and it installed ok. So something peculiar with my main machine. Some of the supposed unnecessary services have been disabled on my main machine and I suspect that is causing the problem. Thanks for your help.

Please Log in or Create an account to join the conversation.

  • William
  • Topic Author
  • Offline
  • Junior Boarder
  • Junior Boarder
More
2 weeks 1 day ago - 2 weeks 1 day ago #14055 by William
Replied by William on topic Install error
Success on my main machine! Not sure which services I re-enabled that were causing the problem.

[FINAL INFO]: Typhon64 BIG-IDE Build OK!!! Have fun.
Last edit: 2 weeks 1 day ago by William.

Please Log in or Create an account to join the conversation.

  • Sternas Stefanos
  • Sternas Stefanos's Avatar
  • Away
  • Moderator
  • Moderator
  • Ex Pilot, M.Sc, Ph.D
More
2 weeks 1 day ago #14058 by Sternas Stefanos
Replied by Sternas Stefanos on topic Install error
Have fun Sir

PilotLogic Architect and Core Programmer

Please Log in or Create an account to join the conversation.