× Discussions for CodeTyphon Studio Installation and Setup.

Question Error Install ct 6.10 Debian 9

  • Juan Rendon
  • Juan Rendon's Avatar Topic Author
  • Offline
  • Fresh Boarder
  • Fresh Boarder
  • Obi Juan Rendobi
More
3 years 3 weeks ago #10860 by Juan Rendon
Error Install ct 6.10 Debian 9 was created by Juan Rendon
Hi i have this error BIG-IDE Build

(9022) Compiling resource /usr/local/codetyphon/typhon/units/x86_64-linux/gtk2/typhon.or
usr/local/codetyphon/typhon/ide/typhon.pp(135,1) Error: (
usr/local/codetyphon/typhon/ide/typhon.pp(135,1) Error: (9030) Can't call the resource compiler "/usr/local/codetyphon/fpc/fpc64/bin/x86_64-linux/fpcres", switching to external mode
usr/local/codetyphon/typhon/ide/typhon.pp(135,1) Fatal: (10026) There were 1 errors compiling module, stopping
atal: (1018) Compilation aborted
ake[2]: *** [typhon] Error 1
ake[1]: *** [ide] Error 2
ake: *** [ide] Error 2
rror: /usr/local/codetyphon/fpc/fpc64/bin/x86_64-linux/ppcx64 returned an error exitcode

Regards
Juan Rendon

Please Log in or Create an account to join the conversation.

  • Sternas Stefanos
  • Sternas Stefanos's Avatar
  • Offline
  • Moderator
  • Moderator
  • Ex Pilot, M.Sc, Ph.D
More
3 years 3 weeks ago #10861 by Sternas Stefanos
Replied by Sternas Stefanos on topic Error Install ct 6.10 Debian 9
Please Sir
give us more info

PilotLogic Architect and Core Programmer

Please Log in or Create an account to join the conversation.

  • Juan Rendon
  • Juan Rendon's Avatar Topic Author
  • Offline
  • Fresh Boarder
  • Fresh Boarder
  • Obi Juan Rendobi
More
3 years 3 weeks ago #10863 by Juan Rendon
Replied by Juan Rendon on topic Error Install ct 6.10 Debian 9
Hi Sir Stefanos

Debian 9 64-bit
Desktop LXDE = gtk2
4 GB ram

make build big-ide 64 i have this error

Error: (9030) Can't call the resource compiler "/usr/local/codetyphon/fpc/fpc64/bin/x86_64-linux/fpcres", switching to external mode

Regards
Juan Rendón

Please Log in or Create an account to join the conversation.

  • Sternas Stefanos
  • Sternas Stefanos's Avatar
  • Offline
  • Moderator
  • Moderator
  • Ex Pilot, M.Sc, Ph.D
More
3 years 3 weeks ago #10864 by Sternas Stefanos
Replied by Sternas Stefanos on topic Error Install ct 6.10 Debian 9
Sir
Did you install system Libraries ?
Did you give root permissions to CT user ?
Did you follow this this tutorial ?

My suggestion:
Open CTCenter execute action "Remove and build all"
save the action log to a file, zip and attach here
info

PilotLogic Architect and Core Programmer

Please Log in or Create an account to join the conversation.

  • Juan Rendon
  • Juan Rendon's Avatar Topic Author
  • Offline
  • Fresh Boarder
  • Fresh Boarder
  • Obi Juan Rendobi
More
3 years 3 weeks ago #10865 by Juan Rendon
Replied by Juan Rendon on topic Error Install ct 6.10 Debian 9
Did you install system Libraries ? YES
Did you give root permissions to CT user ? YES
Did you follow this this tutorial ? I will review the tutorial and send the log.

Regards

Juan Rendón

Please Log in or Create an account to join the conversation.

  • Sternas Stefanos
  • Sternas Stefanos's Avatar
  • Offline
  • Moderator
  • Moderator
  • Ex Pilot, M.Sc, Ph.D
More
3 years 3 weeks ago #10866 by Sternas Stefanos
Replied by Sternas Stefanos on topic Error Install ct 6.10 Debian 9
OK

PilotLogic Architect and Core Programmer

Please Log in or Create an account to join the conversation.

  • Juan Rendon
  • Juan Rendon's Avatar Topic Author
  • Offline
  • Fresh Boarder
  • Fresh Boarder
  • Obi Juan Rendobi
More
3 years 3 weeks ago #10867 by Juan Rendon
Replied by Juan Rendon on topic Error Install ct 6.10 Debian 9
Hi Sir

The same error came out, I sent the Log

regards
Juan Rendón
Attachments:

Please Log in or Create an account to join the conversation.

  • Sternas Stefanos
  • Sternas Stefanos's Avatar
  • Offline
  • Moderator
  • Moderator
  • Ex Pilot, M.Sc, Ph.D
More
3 years 3 weeks ago - 3 years 3 weeks ago #10872 by Sternas Stefanos
Replied by Sternas Stefanos on topic Error Install ct 6.10 Debian 9
Sir
I think the problem is the low PC Memory

My Suggestion
1) Open CTCenter remove Typhon IDE




2) Build Small Typhon IDE




3) Add the packages you want and Self Rebuild Typhon IDE info

PilotLogic Architect and Core Programmer
Attachments:
Last edit: 3 years 3 weeks ago by Sternas Stefanos.

Please Log in or Create an account to join the conversation.

More
10 months 2 weeks ago #13792 by HIGH-Zen
Replied by HIGH-Zen on topic Error Install ct 6.10 Debian 9
Same problem here - CT 6.90 Linux MINT 19.2 Tina 64-bit 4GB RAM
Yes, this is a memory problem.
Fix this by increasing swap (4 GB).

Please Log in or Create an account to join the conversation.

More
10 months 2 weeks ago - 10 months 2 weeks ago #13793 by Matis A.
Replied by Matis A. on topic Error Install ct 6.10 Debian 9
Sir
we test ALL 64bits OSes with 8GBytes RAM

PilotLogic Core Programmer
Last edit: 10 months 2 weeks ago by Matis A..

Please Log in or Create an account to join the conversation.