× General discussions, feature requests for CodeTyphon Project and discussions that don't fit in any of the other specific CodeTyphon forum categories.

Question Typhon32 build bigIDE failure,only small IDE

  • dorry
  • Topic Author
  • Offline
  • Fresh Boarder
  • Fresh Boarder
More
3 years 4 months ago #10566 by dorry
win7 32 bit install codetyphon OK,but build typhon bige IDE by codetyphon,but only builded small IDE.
i had try o lot of times. i could not find the reason?please help?

Please Log in or Create an account to join the conversation.

  • Sternas Stefanos
  • Sternas Stefanos's Avatar
  • Offline
  • Moderator
  • Moderator
  • Ex Pilot, M.Sc, Ph.D
More
3 years 4 months ago #10567 by Sternas Stefanos
Replied by Sternas Stefanos on topic Typhon32 build bigIDE failure,only small IDE
Sir
please ready this

PilotLogic Architect and Core Programmer

Please Log in or Create an account to join the conversation.

  • dorry
  • Topic Author
  • Offline
  • Fresh Boarder
  • Fresh Boarder
More
3 years 4 months ago - 3 years 4 months ago #10569 by dorry
thank sir,I recompiled the typhon bigide from your suggestion,but return error.
win7 32bit ,ram:10GB


C:\codetyphon\typhon\ide\ct_popuppkgs.pas(253,7) Note: (5025) Local variable "xfile" not used
C:\codetyphon\typhon\ide\ct_popuppkgs.pas(18,3) Hint: (5023) Unit "TreeFilterEdit" not used in ct_popuppkgs
(3104) Compiling ct_popupcomppages.pas
C:\codetyphon\typhon\ide\ct_popupcomppages.pas(201,8) Note: (5027) Local variable "xPageIndex" is assigned but never used
C:\codetyphon\typhon\ide\ct_popupcomppages.pas(203,10) Note: (5025) Local variable "ss1" not used
C:\codetyphon\typhon\ide\ct_popupcomppages.pas(39,5) Note: (5029) Private field "TDlgPopupCompPages.fDirForPkgs" is never used
C:\codetyphon\typhon\ide\ct_popupcomppages.pas(16,36) Hint: (5023) Unit "TreeFilterEdit" not used in ct_popupcomppages
(3104) Compiling .\frames\ct_desktop_options_extra.pas
C:\codetyphon\typhon\ide\.\frames\ct_desktop_options_extra.pas(18,44) Hint: (5023) Unit "IDEUtils" not used in ct_desktop_options_extra
(3104) Compiling .\frames\ct_embedded_designer_settings.pas
C:\codetyphon\typhon\ide\ct_main.pp(1023,27) Warning: (4104) Implicit string type conversion from "AnsiString" to "WideString"
C:\codetyphon\typhon\ide\ct_main.pp(1023,53) Warning: (4105) Implicit string type conversion with potential data loss from "WideString" to "AnsiString"
C:\codetyphon\typhon\ide\ct_main.pp(1024,26) Warning: (4104) Implicit string type conversion from "AnsiString" to "WideString"
C:\codetyphon\typhon\ide\ct_main.pp(1024,51) Warning: (4105) Implicit string type conversion with potential data loss from "WideString" to "AnsiString"
C:\codetyphon\typhon\ide\ct_main.pp(1025,28) Warning: (4104) Implicit string type conversion from "AnsiString" to "WideString"
C:\codetyphon\typhon\ide\ct_main.pp(1025,67) Warning: (4105) Implicit string type conversion with potential data loss from "WideString" to "AnsiString"
C:\codetyphon\typhon\ide\ct_main.pp(7453,19) Warning: (5033) Function result does not seem to be set
C:\codetyphon\typhon\components\pl_UIB\lib\i386-win32\win32\uib.ppu:uib.pas(53,10) Error: (1026) Compilation raised exception internally
Fatal: (1009) No memory left
Error: C:\codetyphon\fpc\fpc32\bin\i386-win32\ppc386.exe returned an error exitcode
make[2]: *** [Makefile:4141: typhon.exe] Error 1
make[2]: Leaving directory 'C:/codetyphon/typhon/ide'
make[1]: *** [Makefile:4559: ide] Error 2
make[1]: Leaving directory 'C:/codetyphon/typhon/ide'
make: *** [Makefile:3267: ide] Error 2
make: Leaving directory 'C:/codetyphon/typhon'
Error: (IDE) Build IDE: stopped with exit code 2
Error: (TyphonBuild) Building IDE: Building IDE failed.

?Ҳ? C:\codetyphon\typhon\*.exe

??????????????????????????????????????????????????????
[ERROR]: Typhon32 BIG-IDE NOT Build
??????????????????????????????????????????????????????

_______________________________________________________________

Terminate Action at 2017/2/28 10:05:27
Total time: 00:05:10.019
ExitCode : 0
Last edit: 3 years 4 months ago by dorry.

Please Log in or Create an account to join the conversation.

  • Sternas Stefanos
  • Sternas Stefanos's Avatar
  • Offline
  • Moderator
  • Moderator
  • Ex Pilot, M.Sc, Ph.D
More
3 years 4 months ago - 3 years 4 months ago #10570 by Sternas Stefanos
Replied by Sternas Stefanos on topic Typhon32 build bigIDE failure,only small IDE
Sir
Big IDE has too many packages for your PC memory

The only solution is to
-build Typhon32 small IDE CTCenter=>Typhon-IDE=>Typhon 32, Build Small IDE
-open Typhon32 IDE, select only the packages you need info
-and rebuild IDE

PilotLogic Architect and Core Programmer
Last edit: 3 years 4 months ago by Sternas Stefanos.

Please Log in or Create an account to join the conversation.

  • Avra
  • Visitor
  • Visitor
3 years 3 months ago #10585 by Avra

dorry wrote: thank sir,I recompiled the typhon bigide from your suggestion,but return error.
win7 32bit ,ram:10GB

On 32bit windows you have just a little more then 3GB available...

Please Log in or Create an account to join the conversation.

  • Pierluigi Filippone
  • Offline
  • Fresh Boarder
  • Fresh Boarder
More
1 month 6 days ago #14756 by Pierluigi Filippone
Replied by Pierluigi Filippone on topic Typhon32 build bigIDE failure,only small IDE
For experience, to build big IDE you need minimum 4Gb RAM

Please Log in or Create an account to join the conversation.