Forum

× General Forum discussions that don't fit in any of the other specific forum categories, help etc.

file Question IDE fails to build

  • Roger Boisjoli
  • Roger Boisjoli's Avatar Topic Author
  • Offline
  • Fresh Boarder
  • Fresh Boarder
More
5 months 4 weeks ago - 5 months 4 weeks ago #11618 by Roger Boisjoli
IDE fails to build was created by Roger Boisjoli
I try to install CT on Ubuntu 16.04. The IDE build fails, bot small and big. System suggests I reinstall CT. Did that many time, still no luck. VT Version 6.4, Revision 006400.

==============================================================
Build Typhon64 Small IDE x86_64-linux-gtk2 for Linux
==============================================================


Clean Typhon IDE Setings

[INFO]: Clean Typhon64 IDE Setings finish


Restore Typhon Default IDE Setings

[INFO]: Restore Typhon64 Settings finish

make -C packager/registration
make[1]: Entering directory '/usr/local/codetyphon/typhon/packager/registration'
/bin/rm -f ../units/x86_64-linux/fcllaz.ppu
/usr/local/codetyphon/fpc/fpc64/bin/x86_64-linux/ppcx64 -MObjFPC -Scghi -O1 -g -gl -l -vewnhibq -Fu. -FE. -FU../units/x86_64-linux -Cg -dx86_64 fcllaz.pas
Hint: (11030) Start of reading config file /home/roger/.fpc.cfg
Hint: (11031) End of reading config file /home/roger/.fpc.cfg
Free Pascal Compiler version 3.1.1 [2018/04/22] for x86_64
Copyright (c) 1993-2018 by Florian Klaempfl and others
(1002) Target OS
(1002) Target OS: Linux for x86-64
(3104) Compiling fcllaz.pas
/usr/local/codetyphon/typhon/packager/registration/fcllaz.pas(11,3) Fatal: (10022) Can't find unit db used by fcllaz
Fatal: (1018) Compilation aborted
Makefile:2803: recipe for target 'fcllaz.ppu' failed
make[1]: *** [fcllaz.ppu] Error 1
make[1]: Leaving directory '/usr/local/codetyphon/typhon/packager/registration'
Makefile:3253: recipe for target 'registration' failed
make: *** [registration] Error 2
mv: cannot stat 'typhon': No such file or directory
mv: cannot stat 'typhonstart': No such file or directory
mv: cannot stat 'typhonbuild': No such file or directory
mv: cannot stat 'tools/ctres': No such file or directory
mv: cannot stat 'tools/ctlrstofrm': No such file or directory


[INFO]: Clean Tools Directory


??????????????????????????????????????????????????????????
[ERROR]: Sorry, Typhon64 Small IDE x86_64-linux-gtk2 NOT Build
??????????????????????????????????????????????????????????
_______________________________________________________________

Terminate Action at 22-4-18 12:34:34
Total time: 00:00:10.761
ExitCode : 0
Last edit: 5 months 4 weeks ago by Roger Boisjoli.

Please Log in or Create an account to join the conversation.

  • Sternas Stefanos
  • Sternas Stefanos's Avatar
  • Offline
  • Moderator
  • Moderator
  • Ex Pilot, M.Sc, Ph.D
More
5 months 3 weeks ago #11622 by Sternas Stefanos
Replied by Sternas Stefanos on topic IDE fails to build
Thanks Sir
- did you install System Libraries ?
- more info for your Linux Box, RAM etc... ?

CodeTyphon Architect and Programmer

Please Log in or Create an account to join the conversation.